Home > Error Code > Error 9009 During Script Execution

Error 9009 During Script Execution

Contents

Each one can occur in one of many hundreds of locations in the system. share|improve this answer answered Jul 30 '14 at 12:42 Charles F 1164 add a comment| up vote 0 down vote Check properties -> Bulit Events -> Pre-build event command line and share|improve this answer answered Jul 11 '14 at 0:41 ErikE 25.6k877126 add a comment| up vote 1 down vote This is pretty basic, I had this problem, and embarrassing simple fail. Like Show 3 Likes(3) Actions 1 2 Previous Next Go to original post Related ContentLoading Actions More Like This Retrieving data ... http://netlookmag.com/error-code/error-code-9009-cmd.html

Return Code = 9223 ERROR_SSL_CERTIFICATE_EXPORT_FAILED Failed to export the SSL client certificate bundle. Was online with support and no resolve. You can solve it by deleting commands from Pre/Post-build event command lines. Personally, I think the question "what is MSBuild error 9009?" should be perfectly fine as a stand-alone question, but directed to Microsoft! –The Dag Jul 1 '13 at 14:48

Error 9009 During Script Execution

Return Code = 9213 ERROR_MODULE_NOT_ACTIVE The activation was successful; however, another activation is required to enable use of this application. Return Code = 9005 ERROR_VERIFICATION_FAILED The requested verification activity has failed. You may see this error when using the Assembly Registration tool in a pre- or post-build project in Microsoft Visual C#. Please type your message and try again.

Like Show 0 Likes(0) Actions 4. Please try again later. DNS_ERROR_PRIMARY_REQUIRES_DATAFILE 9651 (0x25B3) Primary DNS zone requires datafile. DNS_ERROR_INVALID_DATAFILE_NAME 9652 (0x25B4) Invalid datafile name for DNS zone. DNS_ERROR_DATAFILE_OPEN_FAILURE 9653 (0x25B5) Failed to open datafile But in my case it was also intermittent. Dns Name Contains An Invalid Character Return Code = 9403 ERROR_MEMORY_ALLOCATION Memory could not be allocated.

It should however be noted that there's nothing stopping any particular application from returning exit code 9009 and meaning something completely different, so it may not be sensible to treat 9009 Error Code 9009 Cmd Applications that manage their own credentials, # such as the internet # information server, are not affected by this. # 4 matches found for "9009" ...so the one you're looking for The command "xcopy.exe /Y C:\projectpath\project.config C:\compilepath\" exited with code 9009. My script is as follows: setup.exe /config config.xml sleep 300 exit It is located in the same folder as the exe.

When I call my voice mail it says my number is not a mailbox number. Command Exited With Code 1 Return Code = 9301 ERROR_SYSTEM_TIME_INVALID System time is not valid. What is this strange biplane jet aircraft with tanks between wings? For example if you write "abcd" in Post-build event command line than the build will end up with Error 1 The command "abcd" exited with code 9009.

Error Code 9009 Cmd

Resolve the problem on the current key master for this zone or use another DNS server to seize the key master role. DNS_ERROR_INVALID_SIGNATURE_VALIDITY_PERIOD 9123 (0x23A3) The specified signature validity period When I closed Visual Studio and opened it again, the problem was fixed. Error 9009 During Script Execution ChristinaB_VZW Follow us on Twitter @VZWSupport Like Show 0 Likes(0) Actions 3. Cmd Errorlevel 9009 Return Code = 9217 ERROR_COULD_NOT_OPEN_REGISTRY_KEY An attempt to open a registry key failed.

They can help in finding the particular reason of command's or application's termination. navigate here We appreciate the input. Join them; it only takes a minute: Sign up What does “exited with code 9009” mean during this build? share|improve this answer edited Nov 21 '14 at 17:31 perlyking 164110 answered May 15 '13 at 14:52 pjdevries 975716 add a comment| up vote 2 down vote For me, disk space Error 9902 In Biometric Attendance

Re: Unable to activate visual voicemail. Get error code 9009. more stack exchange communities company blog Stack Exchange Inbox Reputation and Badges sign up log in tour help Tour Start here for a quick overview of the site Help Center Detailed Check This Out When I look this error code up I get: Program is not recognized as an internal or external command, operable program or batch file.

To more specific answer you need to show us the commands in the Pre/Post-build event command lines. Error Code 9009 Voicemail What are the downsides to multi-classing? I'd forgotten how difficult it was to find information in closed source systems - working with open source for years has spoiled me.

Bill Marked as answer by IamMredMicrosoft employee, Owner Tuesday, March 15, 2011 4:31 AM Thursday, March 10, 2011 6:23 PM Reply | Quote Moderator 0 Sign in to vote The error

I agree with you, batch files aren't going anywhere, but I'm unfortunately required to provide a reference to the official MS documentation of this specific error code if I want to Indicates that the application has been launched on a Desktop to which current user has no access rights. Return Code = 9216 ERROR_COULD_NOT_WRITE_FILE An attempt to write a file failed. Exit 9009 Jenkins Return Code = 9003 ERROR_INVALID_CLIENT_KEY The presence of an invalid client key has been detected.

Febooti SoftwareHome News Products Download Buy Support Contacts» Automation Workshop home Online help Screenshots Tutorials Quick tour FAQ Buy now DownloadProgram exit codesRun DOS / Cmd command Action events (68000, 68002, But they have not given me any solutions. Specify a different user-provided salt, or use a randomly generated salt, and attempt to sign the zone again. DNS_ERROR_NSEC_INCOMPATIBLE_WITH_NSEC3_RSA_SHA1 9130 (0x23AA) NSEC is not compatible with the NSEC3-RSA-SHA-1 algorithm. this contact form Two thoughts: You probably need to have the path to setup.exe in your script.

All the underlying reasons posted in the answers here are good inspiration to figure out why, but the error itself simply means a bad path. Return Code = 9014 ERROR_XML_NODE_MISSING XML node missing. Return Code = 9018 ERROR_DATETIME_CONVERSION_FAILED Date-time conversion failed. It took 20 minutes, but she solved it and said the fix was simple.

share|improve this answer answered May 4 '11 at 8:06 hakksor 6661613 add a comment| up vote 7 down vote I had spaces in my paths. Return Code = 9023 ERROR_ENVELOPE_TYPE_INVALID The envelope is not valid. Return Code = 9222 ERROR_COULD_NOT_SET_PERMISSIONS An attempt to set a file or registry key's permissions failed. At this point, try relaunching the Voice Mail app.

This is absolutely compulsory for batch files! Watson Product Search Search None of the above, continue with my search A Run Task ended with Return Code 9009. For example: %~dp0setup.exe (%~dp0 will expand to the drive and path of the currently running script). Get error code 9009.

I am using CA's IT Client Manager to package the setup files and script and push it down to networked clients. What happens when you try to use the visual voice mail? meaning my PATH is setup correctly, but seems to get up by VS. Zone signing will not be operational until this error is resolved. DNS_ERROR_KSP_NOT_ACCESSIBLE 9112 (0x2398) The specified key service provider cannot be opened by the DNS server. DNS_ERROR_TOO_MANY_SKDS 9113 (0x2399)

This warning is designed to bring this to your attention, as it is imperative that you do not ship your application with an evaluation envelope. You can not post a blank message. Why are terminal consoles still used?